{"text_format":"1","workbook":"xlsx","n_sheets":13,"sheets":["Principal","Matríc","RegistroAusencias","ResumenAusencias","ValorarIndicadores","ValorarConducta","ResumenConducta","InformeCualitativo","Estadística","Información","ACTAFINAL","Acerca de","rubrica"],"not_rendered":{"charts":0,"images":34,"macros":1,"external_links":1,"defined_names":394,"comments":7,"pivot_tables":0},"unopened":[],"bounds":{"document_bytes":16777216,"sheet_cells":100000,"rows_first":2000,"rows_last":500,"rows_between":2000,"halvings":0,"cell_chars":16384,"cell_head_chars":4096},"cells_cut":0,"cells_raw":0,"read":"whole","date_system":"1900"}

{"sheet":"Principal","index":0,"n_rows":3835,"n_cols":29,"rows_kept":3835,"cut":false,"hidden":false,"merged":[[22,0,22,1],[26,0,26,1],[24,0,24,1],[24,2,24,3],[25,0,25,1],[25,2,25,3],[21,0,21,1],[10,2,10,3],[16,0,16,1],[11,0,11,1],[16,2,16,3],[19,0,19,1],[19,2,19,3],[15,2,15,3],[15,0,15,1],[20,2,20,3],[11,2,11,3],[13,0,13,1],[20,0,20,1],[0,0,0,3],[1,0,1,3],[2,0,2,3],[4,2,4,3],[4,0,4,1],[3,0,3,2],[32,0,32,3],[30,0,30,1],[30,2,30,3],[6,2,6,3],[7,2,7,3],[27,2,27,3],[28,0,28,1],[28,2,28,3],[27,0,27,1],[17,0,17,1],[17,2,17,3],[18,0,18,1],[18,2,18,3],[31,0,31,1],[21,2,21,3],[23,0,23,1],[5,0,5,1],[6,0,6,1],[7,0,7,1],[10,0,10,1],[14,0,14,1],[12,0,12,1],[31,2,31,3],[5,2,5,3],[9,2,9,3],[12,2,12,3],[13,2,13,3],[14,2,14,3],[8,2,8,3],[22,2,22,3],[26,2,26,3],[23,2,23,3]]}
["REPÚBLICA DE COSTA RICA",null,null,null,null,"Primaria",null,"Complementaria",null,"Periodos","Logros",null,null,"Nota máxima","Nota mínima","Ponderados","Secciones","Fecha mi","Nombre carpeta respaldo",null,"codigo ","centro educativo","DIRECCIÓN REGIONAL ","circuito","Enlaces",null,null,null,"Contextualización"]
["MINISTERIO DE EDUCACIÓN PÚBLICA",null,null,null,null,null,null,null,null,1,"Avanzado",null,null,100,65,30,"Materno 1",{"$f":"DATE(YEAR(f_i_c),3,1)+7","v":"2020-03-08"},{"$f":"\"Respaldos Registro Cualitativo \" &YEAR(f_i_c)","v":"Respaldos Registro Cualitativo 2020"},null,"6026","COLINAS DEL ESTE","AGUIRRE",1,"http://www.dgec.mep.go.cr/piad/informacion_general"]
["Plantilla Digital del informe descriptivo de logro                                            INGLÉS PREESCOLAR 2020\n",null,null,null,null,null,null,null,null,null,"Intermedio",null,null,null,null,30,"Materno 2",null,null,null,"5736","EL ESTADIO","AGUIRRE",1,"http://www.dgec.mep.go.cr/piad/registros/primaria",null,null,null,"Escenario1"]
["www.dgec.mep.go.cr/piad/registros/primaria",null,null,"www.piadenlinea.mep.go.cr/consultaspiad",null,null,null,null,null,null,"Inicial",null,null,null,null,40,"Materno 3",null,null,null,"3721","EL SUKIA","AGUIRRE",1,"http://www.mep.go.cr/educatico",null,null,null,"Escenario2"]
["Identificación:",null,null,null,null,{"$f":"CELL(\"Address\",F6)&\":\"&\"$\"&SUBSTITUTE(SUBSTITUTE(ADDRESS(ROW(F1),COLUMN(i_tasignaturas)),\"$\",\"\"),ROW(F1),\"\") &\"$\"&COUNTA(tasignaturas)-COUNTIF(tasignaturas,0)+ROW(i_tasignaturas)-ROW(col_tasignaturas)","v":"$F$6:$F$9"},null,{"$f":"CELL(\"Address\",H6)&\":\"&\"$\"&SUBSTITUTE(SUBSTITUTE(ADDRESS(ROW(H1),COLUMN(i_tasignaturas2)),\"$\",\"\"),ROW(H1),\"\") &\"$\"&COUNTA(tasignaturas2)-COUNTIF(tasignaturas2,0)+ROW(i_tasignaturas2)-ROW(col_tasignaturas)","v":"$H$6:$H$12"},"Asignaturas importadas",null,null,null,null,null,null,null,"Materno 4",null,null,null,"3700","LA INMACULADA","AGUIRRE",1,"http://www.relpe.org/herramientas/herramientas/",null,null,null,"Escenario3"]
[null,null,null,null,null,{"$f":"M6","v":"Inglés"},null,null,null,null,null,"Primaria","Inglés",null,null,null,"Materno 5",null,null,null,"3749","LONDRES","AGUIRRE",1,null,null,null,null,"Escenario4"]
["Nombre docente:",null,null,null,null,{"$f":"M7","v":"Inglés Lectura y Escritura"},null,"Inglés",{"$f":"IF(J7>0,\"Importada\",0)","v":0},{"$f":"COUNTIF(RegistroAusencias!$D$7:$D$10004,asi_ing)+COUNTIF(ValorarIndicadores!$C$3:$C$1004,asi_ing)","v":0},null,"Complementaria","Inglés Lectura y Escritura",null,null,null,"Materno 6",null,null,null,"3751","MANUEL ANTONIO","AGUIRRE",1]
[null,null,null,null,null,{"$f":"M8","v":"Inglés Escucha"},null,"Inglés Lectura y Escritura",{"$f":"IF(J8>0,\"Importada\",0)","v":0},{"$f":"COUNTIF(RegistroAusencias!$D$7:$D$10004,asi_ile)+COUNTIF(ValorarIndicadores!$C$3:$C$1004,asi_ile)","v":0},null,null,"Inglés Escucha",null,null,null,"Materno 7",null,null,null,"3772","MARIA LUISA DE CASTRO","AGUIRRE",1]
["Tipo de asignatura:",null,"",null,null,{"$f":"M9","v":"Literatura en Lengua Inglesa"},null,"Inglés Escucha",0,{"$f":"COUNTIF(RegistroAusencias!$D$7:$D$10004,asi_ie)+COUNTIF(ValorarIndicadores!$C$3:$C$1004,asi_ie)","v":0},null,null,"Literatura en Lengua Inglesa",null,null,null,"Materno 8",null,null,null,"3725","PORTON DE NARANJO","AGUIRRE",1]
[null,null,null,null,null,null,null,"Literatura en Lengua Inglesa",0,{"$f":"COUNTIF(RegistroAusencias!$D$7:$D$10004,asi_lli)+COUNTIF(ValorarIndicadores!$C$3:$C$1004,asi_lli)","v":0},null,null,null,null,null,null,"Materno 9",null,null,null,"3786","QUEBRADA ARROYO","AGUIRRE",1]
{"$rows_left_out":3826}
{"sheet":"Matríc","index":1,"n_rows":51,"n_cols":22,"rows_kept":51,"cut":false,"hidden":false,"merged":[[0,1,0,4]]}
[null,{"$f":"Principal!A1&CHAR(10) &Principal!A2","v":"REPÚBLICA DE COSTA RICA\nMINISTERIO DE EDUCACIÓN PÚBLICA"},null,null,null,null,{"$f":"IF(COUNTA( RegistroAusencias!$A$7:$A$10004)+COUNTA(ValorarIndicadores!$B$3:$B$1004)>0,\"no ordena\",\"ordena\")","v":"ordena"},null,null,null,null,null,1]
[null,null,null,null,null,null,null,null,"Cantidad de hombres: 0 Cantidad de mujeres: 0"]
[null,null,null,{"$f":"\"'DATOS BÁSICOS SECCIÓN \"& csección& \" DEL CENTRO EDUCATIVO \"&UPPER(centro_educativo)","v":"'DATOS BÁSICOS SECCIÓN Materno 1 DEL CENTRO EDUCATIVO 0"}]
[null,"Nº","Apellido1","Apellido2","Nombre (s)","Sexo","Identificación","Fecha_Nac","Fecha_Entra","Movimiento1","Fecha_Sale","Movimiento2",null,"Lista concatenada"]
[null,1,null,null,null,null,null,null,null,null,null,null,null,{"$f":"IF(Matríc!$I5>0,CONCATENATE(Matríc!$C5,\" \",Matríc!$D5,\" \",Matríc!$E5),\"\")","v":""},{"$f":"IF(Matríc!$I5>0,Matríc!$G5,0)","v":0},"Proveniente","Traslado","H",null,null,"Lista auxiliar","Cédulas Auxiliares"]
[null,2,null,null,null,null,null,null,null,null,null,null,null,{"$f":"IF(Matríc!$I6>0,CONCATENATE(Matríc!$C6,\" \",Matríc!$D6,\" \",Matríc!$E6),\"\")","v":""},{"$f":"IF(Matríc!$I6>0,Matríc!$G6,0)","v":0},"Nuevo ingreso","Deserción","M",null,null,{"$f":"IF(Matríc!I5>0,Matríc!C5&\" \"&Matríc!D5&\" \"&Matríc!E5,0)","v":0},{"$f":"IF(Matríc!I5>0,Matríc!G5,0)","v":0}]
[null,3,null,null,null,null,null,null,null,null,null,null,null,{"$f":"IF(Matríc!$I7>0,CONCATENATE(Matríc!$C7,\" \",Matríc!$D7,\" \",Matríc!$E7),\"\")","v":""},{"$f":"IF(Matríc!$I7>0,Matríc!$G7,0)","v":0},null,"Defunción",null,null,null,{"$f":"IF(Matríc!I6>0,Matríc!C6&\" \"&Matríc!D6&\" \"&Matríc!E6,0)","v":0},{"$f":"IF(Matríc!I6>0,Matríc!G6,0)","v":0}]
[null,4,null,null,null,null,null,null,null,null,null,null,null,{"$f":"IF(Matríc!$I8>0,CONCATENATE(Matríc!$C8,\" \",Matríc!$D8,\" \",Matríc!$E8),\"\")","v":""},{"$f":"IF(Matríc!$I8>0,Matríc!$G8,0)","v":0},null,null,null,null,null,{"$f":"IF(Matríc!I7>0,Matríc!C7&\" \"&Matríc!D7&\" \"&Matríc!E7,0)","v":0},{"$f":"IF(Matríc!I7>0,Matríc!G7,0)","v":0}]
[null,5,null,null,null,null,null,null,null,null,null,null,null,{"$f":"IF(Matríc!$I9>0,CONCATENATE(Matríc!$C9,\" \",Matríc!$D9,\" \",Matríc!$E9),\"\")","v":""},{"$f":"IF(Matríc!$I9>0,Matríc!$G9,0)","v":0},null,null,null,null,null,{"$f":"IF(Matríc!I8>0,Matríc!C8&\" \"&Matríc!D8&\" \"&Matríc!E8,0)","v":0},{"$f":"IF(Matríc!I8>0,Matríc!G8,0)","v":0}]
[null,6,null,null,null,null,null,null,null,null,null,null,null,{"$f":"IF(Matríc!$I10>0,CONCATENATE(Matríc!$C10,\" \",Matríc!$D10,\" \",Matríc!$E10),\"\")","v":""},{"$f":"IF(Matríc!$I10>0,Matríc!$G10,0)","v":0},null,null,null,null,null,{"$f":"IF(Matríc!I9>0,Matríc!C9&\" \"&Matríc!D9&\" \"&Matríc!E9,0)","v":0},{"$f":"IF(Matríc!I9>0,Matríc!G9,0)","v":0}]
{"$rows_left_out":42}
{"sheet":"RegistroAusencias","index":2,"n_rows":83,"n_cols":142,"rows_kept":83,"cut":false,"hidden":false,"merged":[]}
["Asignatura","Lunes","Martes","Miércoles","Jueves","Viernes",null,null,{"$f":"SUM(E7:F10006)","v":0},null,null,"Días no lectivos","Núm día"]
["Primaria Básicas",null,null,null,null,null,null,null,{"$f":"CELL(\"Address\",ini_est_ausencias)&\":\"&\"$\"&SUBSTITUTE(SUBSTITUTE(ADDRESS(1,COLUMN(ini_inj_ausencias)),\"$\",\"\"),1,\"\") &\"$\"&COUNTA(col_est_ausencias)-COUNTIF(col_est_ausencias,0)+ROW(ini_inj_ausencias)-1","v":"$A$7:$F$6"},null,null,{"$f":"NETWORKDAYS(f_i_c,f_f_p3,12)","v":228}]
["Educación Científica",null,null,null,null,null,null,null,null,null,null,"2020-04-06",2]
["Español",null,null,null,null,null,null,null,{"$f":"COUNTA(resul_lista_ausencias)","v":0},null,null,"2020-04-07",3,null,null,null,null,null,null,null,null,null,null,null,null,null,null,null,null,null,null,null,null,null,null,null,null,null,null,null,null,null,null,null,null,null,null,null,null,null,null,null,null,null,null,null,null,null,null,null,null,null,null,null,null,null,null,null,null,null,null,null,null,null,null,null,null,null,null,null,null,null,null,null,null,null,null,null,null,null,null,null,null,null,null,null,null,null,null,null,null,null,null,null,null,null,null,null,null,null,null,null,null,null,null,null,null,null,null,null,null,null,null,null,null,null,null,null,null,null,null,null,null,null,null,null,null,null,null,null,null,{"$f":"CELL(\"Address\",EL7)&\":\"&\"$\"&SUBSTITUTE(SUBSTITUTE(ADDRESS(1,COLUMN(EL7)),\"$\",\"\"),1,\"\") &\"$\"&COUNTA(A7:A10006)-COUNTIF(A7:A10006,0)+ROW(EL7)-1","v":"$EL$7:$EL$6"}]
["Matemática",null,null,null,null,null,null,null,{"$f":"CELL(\"Address\",i_resul_lista_ausencias)&\":\"&\"$\"&SUBSTITUTE(SUBSTITUTE(ADDRESS(1,COLUMN(i_resul_lista_ausencias)),\"$\",\"\"),1,\"\") &\"$\"&COUNTA(col_nombres_estudiantes)-COUNTIF(resul_lista_ausencias,0)+ROW(i_resul_lista_ausencias)-1","v":"$I$7:$I$6"},null,null,"2020-04-08",4,null,null,null,null,null,null,null,null,null,null,null,null,null,null,null,null,null,null,null,null,null,null,null,null,null,null,null,null,null,null,null,null,null,null,null,null,null,null,null,null,null,null,null,null,null,null,null,null,null,null,null,null,null,null,null,null,null,null,null,null,null,null,null,null,null,null,null,null,null,null,null,null,null,null,null,null,null,null,null,null,null,null,null,null,null,null,null,null,null,null,null,null,null,null,null,null,null,null,null,null,null,null,null,null,null,null,null,null,null,null,null,null,null,null,null,null,null,null,null,null,null,null,null,null,null,null,null,null,{"$f":"INDEX(col_identificación,MATCH(G5,numeración_matrícula,0),0)","v":{"$error":"#N/A"}}]
["Estudiante","Fecha","Tipo Ausencia","Asignatura","Lecciones ausentes","Ausencias injustificadas",null,null,"Seleccione el estudiante","Primer lunes",null,"2020-04-09",5]
[null,null,null,null,null,null,null,1,null,{"$f":"IF(WEEKDAY(f_i_c,2)=6,f_i_c-1,IF(WEEKDAY(f_i_c,2)=7,f_i_c-2,f_i_c))","v":"2020-02-10"},null,"2020-04-10",6]
[null,null,null,null,null,null,null,2,null,{"$f":"WEEKDAY(J7,2)","v":1},null,"2020-05-01",6]
[null,null,null,null,null,null,null,3,null,{"$f":"IF(J8=1,J7,IF(J8=2,J7-1,IF(J8=3,J7-2,IF(J8=4,J7-3,IF(J8=5,J7-4)))))","v":"2020-02-10"},null,"2020-06-29",2]
[null,null,null,null,null,null,null,4,null,{"$f":"InicioSemanas+4","v":"2020-02-14"},null,"2020-06-30",3]
{"$rows_left_out":74}
{"sheet":"ResumenAusencias","index":3,"n_rows":16,"n_cols":23,"rows_kept":16,"cut":false,"hidden":false,"merged":[[0,0,0,2],[5,0,5,8],[3,3,3,8]]}
["Escriba las fechas                 Desde:",null,null,{"$f":"f_i_c","v":"2020-02-10"},"Hasta:",{"$f":"TODAY()","v":"2020-08-24"},null,null,null,null,"Estudiante",null,"DíasExc-Lunes","Nombredía","total lec x dia ","tot lecc días feriados y vacaciones","tot lecc x dia fech estab",0,{"$f":"SUM(S2:S21)","v":0},{"$f":"SUM(T2:T21)","v":0},{"$f":"SUM(U2:U21)","v":0},{"$f":"SUM(V2:V21)","v":0},{"$f":"SUM(W2:W21)","v":0}]
[{"$f":"UPPER(InformeCualitativo!A3)","v":"MINISTERIO DE EDUCACIÓN PÚBLICA"},null,null,null,null,null,null,null,null,null,{"$f":"MATCH(est_inf,ResumenAusencias!C8:C53,0)","v":{"$error":"#N/A"}},null,null,"lunes",136,3,0,{"$f":"asignatura1","v":"Primaria Básicas"},0,0,0,0,0]
[{"$f":"UPPER(InformeCualitativo!A4)","v":"DIRECCIÓN REGIONAL DE EDUCACIÓN 0"},null,null,null,null,null,null,null,null,null,null,null,null,"martes",136,3,0,{"$f":"asignatura2","v":"Educación Científica"},0,0,0,0,0]
[{"$f":"UPPER(InformeCualitativo!A5)","v":"CIRCUITO ESCOLAR 0"},null,null,{"$f":"\"Profesor (a): \"&docente","v":"Profesor (a): "},null,null,null,null,null,null,null,null,null,"miércoles",135,4,0,{"$f":"asignatura3","v":"Español"},0,0,0,0,0]
[{"$f":"UPPER(InformeCualitativo!A6)","v":"CENTRO EDUCATIVO  0"},null,null,null,null,null,null,null,null,null,null,null,null,"jueves",136,3,0,{"$f":"asignatura4","v":"Matemática"},0,0,0,0,0]
["Resumen de ausencias registradas",null,null,null,null,null,null,null,null,null,null,null,null,"viernes",136,3,0,{"$f":"asig_ai","v":"Inglés"}]
["Nº","Identificación","Apellidos y nombre (s)","Lecciones recibidas","Cant. ausencias injustificadas.","% Asistencia","Llegadas tardías justificadas","Ausencias justificadas","Total ausencias",null,null,null,7,"sábado",null,null,null,{"$f":"asig_ap","v":"Inglés Lectura y Escritura"}]
[null,null,null,null,null,null,null,null,null,null,null,null,1,"domingo",null,null,null,{"$f":"asig_ef","v":"Inglés Escucha"}]
[null,null,null,null,null,null,null,null,null,null,null,null,null,null,null,null,null,{"$f":"asig_em","v":"Literatura en Lengua Inglesa"}]
[null,null,null,null,null,null,null,null,null,null,null,null,null,null,null,null,null,{"$f":"asig_eph","v":"Italiano"}]
{"$rows_left_out":7}
{"sheet":"ValorarIndicadores","index":4,"n_rows":1004,"n_cols":53,"rows_kept":1004,"cut":false,"hidden":false,"merged":[]}
["X","xx","X",{"$f":"COUNTA(B3:B1002)","v":0},{"$f":"COUNTA(B3:B1003)","v":0},{"$f":"ROW(ini_fila_lista)","v":5},{"$f":"F1+1","v":6},{"$f":"G1+1","v":7},{"$f":"H1+1","v":8},9,10,11,12,13,14,15,16,17,18,19,20,21,22,23,24,25,26,27,28,29,30,31,32,33,34,35,36,37,38,39,40,41,42,43,{"$f":"AR1+1","v":44},45,46,47,48,49,50,{"$f":"COUNTA(F3:AY1003)","v":0},"BDATOS"]
["0","Indicador de Aprendizaje","Asignatura","Periodo",null,{"$f":"INDIRECT(\"Matríc!\"&SUBSTITUTE(ADDRESS(ROW(ini_fila_lista),COLUMN(ini_fila_lista),3),ROW(ini_fila_lista),\"\")&F1)","v":""},"","","","","","","","","","","","","","","","","","","","","","","","","","","","","","","","","","","","","","","","","","","","",""]
[]
[]
[]
[]
[]
[]
[]
[]
{"$rows_left_out":995}
{"sheet":"ValorarConducta","index":5,"n_rows":17,"n_cols":13,"rows_kept":17,"cut":false,"hidden":false,"merged":[[2,0,2,4]]}
["Seleccione al que le desea registrar el rebajo",null,null,null,"Campos Quesada Rebeca"]
["x"]
["Registro de la valoración de la conducta",null,null,null,null,null,{"$f":"COUNTA(A5:A1000)","v":0}]
[0,"Estudiante","Tipo de falta","Fecha de aplicación","Puntos rebajados","Identificación","Nº","Tipos de falta",{"$f":"H5","v":"1. Muy leve"},{"$f":"H6","v":"2. Leve"},{"$f":"H7","v":"3. Grave"},{"$f":"H8","v":"4. Muy grave"},{"$f":"H9","v":"5. Gravísima"}]
[null,null,null,null,null,null,null,"1. Muy leve",5,10,19,32,45]
[null,null,null,null,null,null,null,"2. Leve",4,9,18,31,44]
[null,null,null,null,null,null,null,"3. Grave",3,8,17,30,43]
[null,null,null,null,null,null,null,"4. Muy grave",2,7,16,29,42]
[null,null,null,null,null,null,null,"5. Gravísima",1,6,15,28,41]
[null,null,null,null,null,null,null,null,null,null,14,27,40]
{"$rows_left_out":8}
{"sheet":"ResumenConducta","index":6,"n_rows":53,"n_cols":20,"rows_kept":53,"cut":false,"hidden":false,"merged":[[5,0,5,9],[0,0,0,2],[2,0,2,5],[1,0,1,5],[3,0,3,5],[4,0,4,5]]}
["Seleccione el periodo:",null,null,null,null,null,null,null,null,null,null,"1"]
[{"$f":"UPPER(InformeCualitativo!A3)","v":"MINISTERIO DE EDUCACIÓN PÚBLICA"}]
[{"$f":"UPPER(InformeCualitativo!A4)","v":"DIRECCIÓN REGIONAL DE EDUCACIÓN 0"}]
[{"$f":"UPPER(InformeCualitativo!A5)","v":"CIRCUITO ESCOLAR 0"},null,null,null,null,null,null,{"$f":"\"Profesor (a): \"&docente","v":"Profesor (a): "}]
[{"$f":"UPPER(InformeCualitativo!A6)","v":"CENTRO EDUCATIVO  0"}]
["Resumen del proceso de valoración de las faltas en conducta",null,null,null,null,null,null,null,null,null,null,null,null,null,null,null,"  b"]
["Nº","Identificación","Apellidos y nombre (s)","Muy leve","Leve","Grave","Muy grave","Gravísima","Calificación de 1 a 100","Valoración de la conducta",null,"Periodo1","Periodo2","Periodo3","Anual",null,"Observaciones p1","Observacionesp2","Observacionesp3","ObserAnuales"]
[null,0,0,null,null,null,null,null,null,null,null,{"$f":"IF(AND(Matríc!I5>0,OR(Matríc!K5=0,Matríc!K5>= f_i_c))=TRUE,nota_máxima-SUMIFS(ValorarConducta!$E$5:$E$1000,ValorarConducta!$E$5:$E$1000,\">0\",ValorarConducta!$B$5:$B$1000,C8,ValorarConducta!$D$5:$D$1000,\">=\"&DATE(YEAR(f_i_c),MONTH(f_i_c),DAY(f_i_c)),ValorarConducta!$D$5:$D$1000,\"<=\"&DATE(YEAR(f_f_p1),MONTH(f_f_p1),DAY(f_f_p1))),0)","v":0},{"$f":"IF(AND(Matríc!I5>0,OR(Matríc!K5=0,Matríc!K5>=f_f_p1))=TRUE,nota_máxima-SUMIFS(ValorarConducta!$E$5:$E$1000,ValorarConducta!$E$5:$E$1000,\">0\",ValorarConducta!$B$5:$B$1000,C8,ValorarConducta!$D$5:$D$1000,\">\"&DATE(YEAR(f_f_p1),MONTH(f_f_p1),DAY(f_f_p1)),ValorarConducta!$D$5:$D$1000,\"<=\"&DATE(YEAR(f_f_p2),MONTH(f_f_p2),DAY(f_f_p2))),0)","v":0},{"$f":"IF(AND(Matríc!I5>0,OR(Matríc!K5=0,Matríc!K5>=f_f_p2))=TRUE,nota_máxima-SUMIFS(ValorarConducta!$E$5:$E$1000,ValorarConducta!$E$5:$E$1000,\">0\",ValorarConducta!$B$5:$B$1000,C8,ValorarConducta!$D$5:$D$1000,\">\"&DATE(YEAR(f_f_p2),MONTH(f_f_p2),DAY(f_f_p2)),ValorarConducta!$D$5:$D$1000,\"<=\"&DATE(YEAR(f_f_p3),MONTH(f_f_p3),DAY(f_f_p3))),0)","v":0},{"$f":"ROUND(IF(AND(L8>0,M8>0,N8>0),((L8*ponderado_p1/nota_máxima)+(N8*ponderado_p2/nota_máxima)+(N8*ponderado_p3/nota_máxima))*nota_máxima/(ponderado_p1+ponderado_p2+ponderado_p3),IF(AND(L8>0,M8=0,N8>0),((L8*ponderado_p1/nota_máxima)+(N8*ponderado_p3/nota_máxima))*nota_máxima/(ponderado_p1+ponderado_p3),IF(AND(L8=0,M8>0,N8>0),((M8*ponderado_p2/nota_máxima)+(N8*ponderado_p3/nota_máxima))*nota_máxima/(ponderado_p2+ponderado_p3),IF(AND(L8>0,M8>0,N8=0),((L8*ponderado_p1/nota_máxima)+(M8*ponderado_p2/nota_máxima))*nota_máxima/(ponderado_p1+ponderado_p2))))),0)","v":0}]
[null,0,0,null,null,null,null,null,null,null,null,{"$f":"IF(AND(Matríc!I6>0,OR(Matríc!K6=0,Matríc!K6>= f_i_c))=TRUE,nota_máxima-SUMIFS(ValorarConducta!$E$5:$E$1000,ValorarConducta!$E$5:$E$1000,\">0\",ValorarConducta!$B$5:$B$1000,C9,ValorarConducta!$D$5:$D$1000,\">=\"&DATE(YEAR(f_i_c),MONTH(f_i_c),DAY(f_i_c)),ValorarConducta!$D$5:$D$1000,\"<=\"&DATE(YEAR(f_f_p1),MONTH(f_f_p1),DAY(f_f_p1))),0)","v":0},{"$f":"IF(AND(Matríc!I6>0,OR(Matríc!K6=0,Matríc!K6>=f_f_p1))=TRUE,nota_máxima-SUMIFS(ValorarConducta!$E$5:$E$1000,ValorarConducta!$E$5:$E$1000,\">0\",ValorarConducta!$B$5:$B$1000,C9,ValorarConducta!$D$5:$D$1000,\">\"&DATE(YEAR(f_f_p1),MONTH(f_f_p1),DAY(f_f_p1)),ValorarConducta!$D$5:$D$1000,\"<=\"&DATE(YEAR(f_f_p2),MONTH(f_f_p2),DAY(f_f_p2))),0)","v":0},{"$f":"IF(AND(Matríc!I6>0,OR(Matríc!K6=0,Matríc!K6>=f_f_p2))=TRUE,nota_máxima-SUMIFS(ValorarConducta!$E$5:$E$1000,ValorarConducta!$E$5:$E$1000,\">0\",ValorarConducta!$B$5:$B$1000,C9,ValorarConducta!$D$5:$D$1000,\">\"&DATE(YEAR(f_f_p2),MONTH(f_f_p2),DAY(f_f_p2)),ValorarConducta!$D$5:$D$1000,\"<=\"&DATE(YEAR(f_f_p3),MONTH(f_f_p3),DAY(f_f_p3))),0)","v":0},0]
[null,0,0,null,null,null,null,null,null,null,null,{"$f":"IF(AND(Matríc!I7>0,OR(Matríc!K7=0,Matríc!K7>= f_i_c))=TRUE,nota_máxima-SUMIFS(ValorarConducta!$E$5:$E$1000,ValorarConducta!$E$5:$E$1000,\">0\",ValorarConducta!$B$5:$B$1000,C10,ValorarConducta!$D$5:$D$1000,\">=\"&DATE(YEAR(f_i_c),MONTH(f_i_c),DAY(f_i_c)),ValorarConducta!$D$5:$D$1000,\"<=\"&DATE(YEAR(f_f_p1),MONTH(f_f_p1),DAY(f_f_p1))),0)","v":0},{"$f":"IF(AND(Matríc!I7>0,OR(Matríc!K7=0,Matríc!K7>=f_f_p1))=TRUE,nota_máxima-SUMIFS(ValorarConducta!$E$5:$E$1000,ValorarConducta!$E$5:$E$1000,\">0\",ValorarConducta!$B$5:$B$1000,C10,ValorarConducta!$D$5:$D$1000,\">\"&DATE(YEAR(f_f_p1),MONTH(f_f_p1),DAY(f_f_p1)),ValorarConducta!$D$5:$D$1000,\"<=\"&DATE(YEAR(f_f_p2),MONTH(f_f_p2),DAY(f_f_p2))),0)","v":0},{"$f":"IF(AND(Matríc!I7>0,OR(Matríc!K7=0,Matríc!K7>=f_f_p2))=TRUE,nota_máxima-SUMIFS(ValorarConducta!$E$5:$E$1000,ValorarConducta!$E$5:$E$1000,\">0\",ValorarConducta!$B$5:$B$1000,C10,ValorarConducta!$D$5:$D$1000,\">\"&DATE(YEAR(f_f_p2),MONTH(f_f_p2),DAY(f_f_p2)),ValorarConducta!$D$5:$D$1000,\"<=\"&DATE(YEAR(f_f_p3),MONTH(f_f_p3),DAY(f_f_p3))),0)","v":0},0]
{"$rows_left_out":44}
{"sheet":"InformeCualitativo","index":7,"n_rows":10,"n_cols":6,"rows_kept":10,"cut":false,"hidden":false,"merged":[[1,2,1,3],[4,2,4,3],[6,0,6,5],[8,0,8,5],[7,0,7,5]]}
["Seleccione estudiante:",null,"1",{"$f":"\"Periodo:\"&per_inf","v":"Periodo:1"},{"$f":"Principal!A17&\" \"&csección","v":"Sección: Materno 1"}]
["REPÚBLICA DE COSTA RICA",null,"",null,{"$f":"CELL(\"Address\",A2)&\":\"&\"$\"&SUBSTITUTE(SUBSTITUTE(ADDRESS(1,COLUMN(ini_rec_inf)),\"$\",\"\"),1,\"\") &\"$\"&COUNTA($B$11:$B$1008)-COUNTIF($B$11:$B$1008,0)+ROW(ini_rec_inf)+10","v":"$A$2:$D$21"}]
["MINISTERIO DE EDUCACIÓN PÚBLICA",null,{"$f":"YEAR(f_i_c)","v":2020}]
[{"$f":"\"DIRECCIÓN REGIONAL DE EDUCACIÓN \"&regional","v":"DIRECCIÓN REGIONAL DE EDUCACIÓN 0"},null,"Escenario3"]
[{"$f":"\"CIRCUITO ESCOLAR \"&circuito","v":"CIRCUITO ESCOLAR 0"},null,{"$f":"docente","v":0}]
[{"$f":"\"CENTRO EDUCATIVO  \"&centro_educativo","v":"CENTRO EDUCATIVO  0"}]
["PLANTILLA DIGITAL INFORME DESCRIPTIVO DE LOGRO \nPARA INGLÉS PREESCOLAR\nI PERIODO 2020\n\n"]
["Escenario 1: Uso de tecnologías y conectividad/ Escenario 2: Uso de tecnologías y conectividad limitada/ Escenario 3: Presencia de tecnologías sin conectividad/ Escenario 4: Ausencia de tecnologías"]
["Descripción de niveles de logro: No logrado: La  persona estudiante no puede lograr la tarea lingüística. En Progreso: La persona estudiante puede lograr la tarea lingüística con alguna dificultad y necesita mejorar.                                                                            Logrado:La persona estudiante puede lograr la tarea lingüística sin ninguna dificultad."]
["Asignatura","Indicadores de aprendizaje esperado","Nivel de Desempeño","Recomendaciones","Observaciones generales de la persona docente en cuanto al proceso","Evidencias Presentadas"]
{"$rows_left_out":1}
{"sheet":"Estadística","index":8,"n_rows":21,"n_cols":14,"rows_kept":21,"cut":false,"hidden":false,"merged":[[5,1,6,1],[5,2,5,4],[5,5,5,7],[5,8,5,10],[5,11,5,13]]}
[null,"         MINISTERIO DE EDUCACIÓN PÚBLICA"]
[null,{"$f":"InformeCualitativo!A4","v":"DIRECCIÓN REGIONAL DE EDUCACIÓN 0"}]
[null,{"$f":"InformeCualitativo!A5","v":"CIRCUITO ESCOLAR 0"}]
[null,{"$f":"InformeCualitativo!A6","v":"CENTRO EDUCATIVO  0"}]
[]
[null,"TIPO DE MOVIMIENTO","PERIODO1",null,null,"PERIODO2",null,null,"PERIODO3",null,null,"ANUAL"]
[null,null,"T ","H","M","T ","H","M","T ","H","M","T ","H","M"]
[null,"MATRICULA INICIAL / ANTERIOR"]
[null,"PROVENIENTES DE OTRAS INSTITUCIONES"]
[null,"NUEVOS INGRESOS"]
{"$rows_left_out":12}
{"sheet":"Información","index":9,"n_rows":0,"n_cols":0,"rows_kept":0,"cut":false,"hidden":false,"merged":[]}

{"sheet":"ACTAFINAL","index":10,"n_rows":58,"n_cols":26,"rows_kept":58,"cut":false,"hidden":false,"merged":[[3,0,3,6],[4,0,4,6],[9,0,9,6]]}
["      MINISTERIO DE EDUCACIÓN PÚBLICA",null,null,null,null,null,null,{"$f":"COUNTA(rango_acta)","v":0}]
["DIRECCION DE GESTIÓN Y EVALUACIÓN DE LA CALIDAD",null,null,null,null,null,null,null,"Aprobado"]
[null,null,null,null,null,null,{"$f":"\"SECCIÓN: \"&csección","v":"SECCIÓN: Materno 1"},null,"Reprobado"]
["FÓRMULA PRIMER AÑO EGB"]
[{"$f":"\"CURSO LECTIVO \"&YEAR(f_i_c)","v":"CURSO LECTIVO 2020"}]
[]
[{"$f":"\"DIRECCIÓN REGIONAL: \"&UPPER(regional)","v":"DIRECCIÓN REGIONAL: 0"},null,null,null,null,{"$f":"\"CIRCUITO ESCOLAR: \" &circuito","v":"CIRCUITO ESCOLAR: 0"},null,null,null,null,null,null,null,null,null,null,null,null,null,null,"I CICLO:",null,null,null,"-","-"]
[{"$f":"\"CENTRO EDUCATIVO: \"&UPPER(centro_educativo)","v":"CENTRO EDUCATIVO: 0"},null,null,null,null,{"$f":"\"CÓDIGO: \"&código","v":"CÓDIGO: "},null,null,null,null,null,null,null,null,null,null,null,null,null,null,null,null,null,null,"2°","3°"]
[null,null,null,null,null,null,null,null,null,null,null,null,null,null,null,null,null,null,null,null,"II CICLO:",null,null,"-","-","-"]
[{"$f":"\"Total estudiantes: \"&COUNTA(D13:D59) &\" Total hombres: \"&COUNTIF(E13:E59,\"H\")&\" Total mujeres: \"&COUNTIF(E13:E59,\"M\") &\" Total aprobados: \"&COUNTIF(G13:G59,\"Aprobado\")&\" Total reprobados: \"&COUNTIF(G13:G59,\"Reprobado\")","v":"Total estudiantes: 0 Total hombres: 0 Total mujeres: 0 Total aprobados: 0 Total reprobados: 0"}]
{"$rows_left_out":49}
{"sheet":"Acerca de","index":11,"n_rows":37,"n_cols":1,"rows_kept":37,"cut":false,"hidden":false,"merged":[]}
["República de Costa Rica"]
["Propiedad del Ministerio de Educación Pública"]
["Versión agosto 2020"]
["Compatible con Excel 2007 o superior"]
[]
["Desarrollado por:"]
["MSc. César Pimentel Batista"]
[]
["Modificado por:"]
["Melba Orozco Delgadillo"]
{"$rows_left_out":28}
{"sheet":"rubrica","index":12,"n_rows":33,"n_cols":5,"rows_kept":33,"cut":false,"hidden":false,"merged":[]}
[]
[]
[]
[null,"MINISTERIO DE EDUCACIÓN PÚBLICA"]
[null,"DEPARTAMENTO DE EDUCACIÓN DE LA PRIMERA INFANCIA"]
[null,null,null,"MODALIDAD INGLÉS POR LECCIONES - CICLO  TRANSICIÓN"]
[null,"Ciclo de Transición",null,"Niveles de Logro"]
[]
[null,"Indicadores","No logrado","En progreso","Logrado"]
[null,null,"La  persona estudiante no  logra el aprendizaje esperado.    ","\nLa persona estudiante logra el aprendizaje esperado con ayuda.","La persona estudiante  logra el aprendizaje esperado sin ayuda."]
{"$rows_left_out":23}